Heptaphosphatricyclo[2.2.1.02,6heptane, trimethyl-

Gas phase ion energetics data

Data compiled by: Sharon G. Lias, John E. Bartmess, Joel F. Liebman, John L. Holmes, Rhoda D. Levin, and W. Gary Mallard

Ionization energy determinations

IE (eV) Method Reference Comment
7.7PEGleiter, Bohm, et al., 1983
8.3PEGleiter, Bohm, et al., 1983Vertical value

References

Gleiter, Bohm, et al., 1983
Gleiter, R.; Bohm, M.C.; Eckert-Maksic, M.; Schafer, W.; Baudler, M.; Aktalay, Y.; Fritz, G.; Hoppe, K.-D., The electronic structure of phosphorus cages with the nortricyclane skeleton. Model calculations and photoelectron spectroscopic investigations, Chem. Ber., 1983, 116, 2972. [all data]