1,4:5,8-Dimethanonaphthalene, 1,2,3,4,5,6,7,8-octahydro-, (1α,4α,5α,8.alpha)-

Gas phase ion energetics data

Data compiled by: Sharon G. Lias, John E. Bartmess, Joel F. Liebman, John L. Holmes, Rhoda D. Levin, and W. Gary Mallard

Ionization energy determinations

IE (eV) Method Reference Comment
8.12PEKunzer, Litterst, et al., 1987Vertical value
8.12 ± 0.02PEBrown, Buschek, et al., 1983Vertical value

References

Kunzer, Litterst, et al., 1987
Kunzer, H.; Litterst, E.; Gleiter, R.; Paquette, L.A., Physico-chemical studies of doubly and triply unsatured syn- and anti-sesquinorboranes. Photoelectron spectroscopy, molecular orbital calculations, and deuterium-induced 13C NMR shifts, J. Org. Chem., 1987, 52, 4740. [all data]

Brown, Buschek, et al., 1983
Brown, R.S.; Buschek, J.M.; Kopecky, K.R.; Miller, A.J., Photoelectron spectra of syn- and anti-sesquinorbornene. Evidence for vertical Σ-π delocalization in bicyclo[2.2.1]heptene, J. Org. Chem., 1983, 48, 3692. [all data]