Baptifoline

Normal alkane RI, non-polar column, temperature ramp

Data compiled by: NIST Mass Spectrometry Data Center, William E. Wallace, director

Column type CapillaryCapillaryCapillaryCapillary
Active phase DB-1DB-1DB-1DB-1
Column length (m) 30.30.30.30.
Carrier gas HeHeHe
Substrate
Column diameter (mm) 0.320.320.320.32
Phase thickness (μm)
Tstart (C) 150.150.150.150.
Tend (C) 300.300.300.300.
Heat rate (K/min) 6.6.6.6.
Initial hold (min)
Final hold (min)
I 2635.2645.2655.2630.
ReferenceGreinwald, Bachmann, et al., 1995Greinwald, Henrichs, et al., 1995Kirch, Veit, et al., 1995van Wyk, Greinwald, et al., 1995
Comment MSDC-RI MSDC-RI MSDC-RI MSDC-RI

References

Greinwald, Bachmann, et al., 1995
Greinwald, R.; Bachmann, P.; Lewis, G.; Witte, L.; Czygan, F.-C., Alkaloids of the genus Poecilanthe (Leguminosae: Papilionoideae), Biochem. Syst. Ecol., 1995, 23, 5, 547-553, https://doi.org/10.1016/0305-1978(95)00050-5 . [all data]

Greinwald, Henrichs, et al., 1995
Greinwald, R.; Henrichs, C.; Veen, G.; Ross, J.H.; Witte, L.; Czygan, F.-C., A survey of alkaloids in templetonia biloba (Benth.) Polhill (Fabaceae: Brongniartieae), Biochem. Syst. Ecol., 1995, 23, 6, 649-654, https://doi.org/10.1016/0305-1978(95)00035-6 . [all data]

Kirch, Veit, et al., 1995
Kirch, J.; Veit, M.; Wätzig, Greinwald; Czygan, F.-C., Alkaloidal variation in Genista Iobelii s.l. (Fabaceae), Biochem. Syst. Ecol., 1995, 23, 6, 635-643, https://doi.org/10.1016/0305-1978(95)00037-2 . [all data]

van Wyk, Greinwald, et al., 1995
van Wyk, B.-E.; Greinwald, R.; Witte, L., Alkaloid variation in the Lupinus pusillus group (Fabaceae: tribe Genisteae), Biochem. Syst. Ecol., 1995, 23, 5, 533-537, https://doi.org/10.1016/0305-1978(95)00036-T . [all data]