8,11,14-Eicosatrienoic acid

Kovats' RI, non-polar column, temperature ramp

Data compiled by: NIST Mass Spectrometry Data Center, William E. Wallace, director

Column type Capillary
Active phase DB-1
Column length (m) 50.
Carrier gas N2
Substrate
Column diameter (mm) 0.25
Phase thickness (μm) 0.25
Tstart (C) 95.
Tend (C) 240.
Heat rate (K/min) 4.
Initial hold (min)
Final hold (min)
I 2135.
ReferenceVelasco-Negueruela, Sanz, et al., 2004
Comment MSDC-RI

References

Velasco-Negueruela, Sanz, et al., 2004
Velasco-Negueruela, A.; Sanz, J.; Pérez-Alonso, M.J.; Palá-Paúl, J., The volatile components of the aerial parts of Melittis melissophyllum L. subsp. melissophyllum gathered in Spain, Botanica Complutensis, 2004, 28, 133-136. [all data]