Dibenzofuran, 4-methyl-

Van Den Dool and Kratz RI, non-polar column, custom temperature program

Data compiled by: NIST Mass Spectrometry Data Center, William E. Wallace, director

Column type Capillary
Active phase DB-5
Column length (m) 30.
Carrier gas He
Substrate
Column diameter (mm) 0.25
Phase thickness (μm) 0.25
Program 60 0C 7 0C/min -> 130 0C 5 0C/min -> 200 0C 6 0C/min -> 260 0C 20 0C/min -> 320 0C (4 min)
I 1639.
ReferenceHavenga and Rohwer, 1999
Comment MSDC-RI

Normal alkane RI, non-polar column, temperature ramp

Data compiled by: NIST Mass Spectrometry Data Center, William E. Wallace, director

Column type Capillary
Active phase HP-5 MS
Column length (m) 30.
Carrier gas Helium
Substrate
Column diameter (mm) 0.25
Phase thickness (μm) 0.25
Tstart (C) 70.
Tend (C) 290.
Heat rate (K/min) 5.
Initial hold (min)
Final hold (min) 10.
I 1638.
ReferenceRadulovic, Blagojevic, et al., 2010
Comment MSDC-RI

References

Havenga and Rohwer, 1999
Havenga, W.J.; Rohwer, E.R., Chemical Characterization and Screening of Hydrocarbon Pollution in Industrial Soils by Headspace Solid-Phase Microextraction, J. Chromatogr., 1999, 848, 1-2, 279-295, https://doi.org/10.1016/S0021-9673(99)00522-1 . [all data]