3-Methyldibenzofuran

Lee's RI, non-polar column, custom temperature program

Data compiled by: NIST Mass Spectrometry Data Center, William E. Wallace, director

Column type Capillary
Active phase HP-5MS
Column length (m) 30.
Carrier gas
Substrate
Column diameter (mm) 0.25
Phase thickness (μm) 0.25
Program not specified
I 273.65
ReferenceZhou, Wang, et al., 2004
Comment MSDC-RI

References

Zhou, Wang, et al., 2004
Zhou, J.; Wang, T.; Shi, Q.; Huang, Y.; Mao, T.; Zhong, N.; Zhang, Y.; Zhang, X., Determination of sulfur and oxygen containing polycyclic aromatic hydrocarbons in inhalable particulate by gas chromatography - mass spectrometry, J. Chin. Mass Spectrom. Soc., 2004, 25, 3, 134-140. [all data]