NeXeF

Vibrational and/or electronic energy levels

Data compiled by: Marilyn E. Jacox

State:   ?

 Energy
 (cm-1
 Med.   Transition   λmin
 (nm)
 λmax
 (nm)

References

gas 370 550 Rokni, Jacob, et al., 1979

Additional references: Jacox, 1994, page 121

Rokni, Jacob, et al., 1979
Rokni, M.; Jacob, J.H.; Hsia, J.C.; Trainor, D.W., The origin of the broadband emission of XeF, Appl. Phys. Lett., 1979, 35, 10, 729, https://doi.org/10.1063/1.90965 . [all data]

Jacox, 1994
Jacox, M.E., Vibrational and electronic energy levels of polyatomic transient molecules, American Chemical Society, Washington, DC, 1994, 464. [all data]