Hexanedioic acid, 3-trimethylsiloxy-, bis(trimethylsilyl) ester

Normal alkane RI, non-polar column, temperature ramp

Data compiled by: NIST Mass Spectrometry Data Center, William E. Wallace, director

Column type Capillary
Active phase SE-52
Column length (m) 25.
Carrier gas He
Substrate
Column diameter (mm) 0.32
Phase thickness (μm) 0.12
Tstart (C) 70.
Tend (C) 270.
Heat rate (K/min) 5.
Initial hold (min)
Final hold (min)
I 1699.
ReferenceVerhaeghe, van Bocxlaer, et al., 1992
Comment MSDC-RI

References

Verhaeghe, van Bocxlaer, et al., 1992
Verhaeghe, B.J.; van Bocxlaer, J.F.; de Leenheer, A.P., Gas chromatographic/mass spectrometric identification of 3-hydroxydicarboxylic acids in urine, Biol. Mass Spectrom., 1992, 21, 1, 27-32, https://doi.org/10.1002/bms.1200210107 . [all data]