Hexane, 1-(ethylthio)-

Kovats' RI, polar column, isothermal

Data compiled by: NIST Mass Spectrometry Data Center, William E. Wallace, director

Column type CapillaryCapillaryPacked
Active phase PEG-20MPEG-20MPolyethylene Glycol
Column length (m) 50.50.2.1
Carrier gas  N2N2
Substrate   Chromosorb W
Column diameter (mm) 0.250.25
Phase thickness (μm)
Temperature (C) 93.80.130.
I 1291.21286.61311.
ReferenceMorishita, Murakita, et al., 1985Morishita, Murakita, et al., 1982Golovnya, Garbuzov, et al., 1976
Comment MSDC-RI MSDC-RI MSDC-RI

References

Morishita, Murakita, et al., 1985
Morishita, F.; Murakita, H.; Kojima, T., Prediction of retention indices of thiols and sulfides under different conditions of capillary gas chromatography, Bunseki Kagaku, 1985, 34, 12, 800-802, https://doi.org/10.2116/bunsekikagaku.34.12_800 . [all data]

Morishita, Murakita, et al., 1982
Morishita, F.; Murakita, H.; Takemura, Y.; Kojima, T., Prediction of molecular structures of thiols and sulphides by retention indices, J. Chromatogr., 1982, 239, 483-492, https://doi.org/10.1016/S0021-9673(00)82005-1 . [all data]

Golovnya, Garbuzov, et al., 1976
Golovnya, R.V.; Garbuzov, V.G.; Misharina, T.A., Gas chromatographic characteristics of sulfur compounds. 2. Normal sulfides, Izv. Akad. Nauk Kaz. SSR Ser. Khim., 1976, 10, 2266-2270. [all data]