1-Undecanamine

Phase change data

Data compiled as indicated in comments:
BS - Robert L. Brown and Stephen E. Stein
TRC - Thermodynamics Research Center, NIST Boulder Laboratories, Chris Muzny director

Quantity Value Units Method Reference Comment
Tboil513.2KN/AAldrich Chemical Company Inc., 1990BS
Tboil515.2KN/AWeast and Grasselli, 1989BS
Tboil515.KN/AAmerican Tokyo Kasei, 1988BS
Quantity Value Units Method Reference Comment
Tfus288.15KN/ARichet, 1946Uncertainty assigned by TRC = 1. K; TRC
Tfus288.65KN/ANaegeli, Gruntuch, et al., 1929Uncertainty assigned by TRC = 2. K; TRC
Tfus288.15KN/AJeffreys, 1899Uncertainty assigned by TRC = 1. K; TRC

In addition to the Thermodynamics Research Center (TRC) data available from this site, much more physical and chemical property data is available from the following TRC products:

Kovats' RI, non-polar column, isothermal

View large format table.

Column type Active phase Temperature (C) I Reference Comment
PackedPMS-100180.1330.Anderson, Jurel, et al., 1973He, Celite 545 (44-60 mesh); Column length: 3. m

Kovats' RI, polar column, isothermal

View large format table.

Column type Active phase Temperature (C) I Reference Comment
PackedPEG-2000150.1623.Anderson, Jurel, et al., 1973He, Celite 545 (44-60 mesh); Column length: 3. m
PackedPEG-2000152.1625.Anderson, Jurel, et al., 1973He, Celite 545 (44-60 mesh); Column length: 3. m
PackedPEG-2000179.1620.Anderson, Jurel, et al., 1973He, Celite 545 (44-60 mesh); Column length: 3. m
PackedPEG-2000180.1618.Anderson, Jurel, et al., 1973He, Celite 545 (44-60 mesh); Column length: 3. m
PackedPEG-2000200.1610.Anderson, Jurel, et al., 1973He, Celite 545 (44-60 mesh); Column length: 3. m

References

Aldrich Chemical Company Inc., 1990
Aldrich Chemical Company Inc., Catalog Handbook of Fine Chemicals, Aldrich Chemical Company, Inc., Milwaukee WI, 1990, 1. [all data]

Weast and Grasselli, 1989
CRC Handbook of Data on Organic Compounds, 2nd Editon, Weast,R.C and Grasselli, J.G., ed(s)., CRC Press, Inc., Boca Raton, FL, 1989, 1. [all data]

American Tokyo Kasei, 1988
American Tokyo Kasei, TCI American Organic Chemical 88/89 Catalog, American Tokyo Kasei, Portland, OR, 1988, 1610. [all data]

Richet, 1946
Richet, H., On the Chlorides, Amides, and AMines of the Fatty Acids, Bull. Soc. Chim. Fr., 1946, 13, 52. [all data]

Naegeli, Gruntuch, et al., 1929
Naegeli, C.; Gruntuch, L.; Lendorff, P., A Modified Curtius Degradation III. The Degradation of Saturated Fatty Acids and Benzoic Acid, Helv. Chim. Acta, 1929, 12, 227. [all data]

Jeffreys, 1899
Jeffreys, E., On Undecylamine and Pentadecylamine and the Preparation of the Higher Amines of the Aliphatic Series, Am. Chem. J., 1899, 22, 14. [all data]

Anderson, Jurel, et al., 1973
Anderson, A.; Jurel, S.; Shymanska, M.; Golender, L., Gas-liquid chromatography of some aliphatic and heterocyclic mono- and pollyfunctional amines. VII. Retention indices of amines in some polar and unpolar stationary phases, Latv. PSR Zinat. Akad. Vestis Kim. Ser., 1973, 1, 51-63. [all data]