1,5-Propano-2H-1,5-benzodiazepine, 3,4-dihydro-

Gas phase ion energetics data

Data compiled by: Sharon G. Lias, Rhoda D. Levin, and Sherif A. Kafafi

Ionization energy determinations

IE (eV) Method Reference Comment
7.91PENelsen, Grezzo, et al., 1981Vertical value

References

Nelsen, Grezzo, et al., 1981
Nelsen, S.F.; Grezzo, L.A.; Hollinsed, W.C., Effects of structure on the ease of electron removal from o-phenylenediamines. 2. Photoelectron spectra of o-phenylenediamines, J. Org. Chem., 1981, 46, 283. [all data]