Heptanoic acid, 3,7-dimethyl-2,6-octadienyl ester, (E)-

Kovats' RI, non-polar column, custom temperature program

Data compiled by: NIST Mass Spectrometry Data Center, William E. Wallace, director

Column type CapillaryCapillary
Active phase BP-1BP-1
Column length (m) 30.25.
Carrier gas N2N2
Substrate
Column diameter (mm) 0.320.32
Phase thickness (μm) 0.250.25
Program 60C => 5C/min => 220C (5min) => 3C/min => 245C(5min)60C => 5C/min => 220C(5min) => 3C/min => 245C(5min)
I 1827.1835.
ReferenceKhan, Verma, et al., 2006Raina, Srivastava, et al., 2003
Comment MSDC-RI MSDC-RI

Van Den Dool and Kratz RI, non-polar column, temperature ramp

Data compiled by: NIST Mass Spectrometry Data Center, William E. Wallace, director

Column type CapillaryCapillary
Active phase BP-1HP-5
Column length (m) 30.30.
Carrier gas N2He
Substrate
Column diameter (mm) 0.320.25
Phase thickness (μm) 0.250.25
Tstart (C) 60.40.
Tend (C) 220.240.
Heat rate (K/min) 5.3.
Initial hold (min)
Final hold (min) 13.
I 1824.1857.
ReferenceRaina, Kumar, et al., 2004Shellie and Marriott, 2003
Comment MSDC-RI MSDC-RI

References

Khan, Verma, et al., 2006
Khan, M.; Verma, S.C.; Srivastava, S.K.; Shawl, A.S.; Syamsundar, K.V.; Khanuja, S.P.S.; Kumar, T., Essential oil composition of Taxus wallichiana Zucc. from the Northern Himalayan region of India, Flavour Fragr. J., 2006, 21, 5, 772-775, https://doi.org/10.1002/ffj.1682 . [all data]

Raina, Srivastava, et al., 2003
Raina, V.K.; Srivastava, S.K.; Aggarwal, K.K.; Syamasunder, K.V.; Khanuja, S.P.S., Essential oil composition of Cymbopogon martinii from different places in India, Flavour Fragr. J., 2003, 18, 4, 312-315, https://doi.org/10.1002/ffj.1222 . [all data]