6-Chloropyridin-2-ol

Reaction thermochemistry data

Data compiled by: Hussein Y. Afeefy, Joel F. Liebman, and Stephen E. Stein

Individual Reactions

6-Chloropyridin-2-ol = 6-Chloro-2-pyridinol

By formula: C5H4ClNO = C5H4ClNO

Quantity Value Units Method Reference Comment
Δr1.385kcal/molEqkSheinker, Peresleni, et al., 1970liquid phase; solvent: Dioxane

References

Sheinker, Peresleni, et al., 1970
Sheinker, Yu.N.; Peresleni, E.M.; Rezchikova, I.S.; Zosimova, N.P., Temperature dependence and thermodynamic characteristics of the lactam-lactim tautomeric equilibrium of some 2-hydroxypyridine derivatives, Dokl. Phys. Chem. (Engl. Transl.), 1970, 192, 454-456, In original 1295. [all data]