Cyclohexanol, 1-methyl-4-(1-methylethenyl)-, cis-

Van Den Dool and Kratz RI, non-polar column, temperature ramp

Data compiled by: NIST Mass Spectrometry Data Center, William E. Wallace, director

Column type CapillaryCapillaryCapillaryCapillaryCapillary
Active phase Ultra-2SPB-5HP-5MSCP Sil 5 CBCP Sil 5 CB
Column length (m) 25.30.30.30.50.
Carrier gas H2He H2He
Substrate
Column diameter (mm) 0.250.250.250.250.32
Phase thickness (μm) 0.330.250.250.250.4
Tstart (C) 40.60.50.60.60.
Tend (C) 280.250.280.280.280.
Heat rate (K/min) 3.4.3.2.3.
Initial hold (min) 2.2.5.10.10.
Final hold (min) 10.20. 40.60.
I 1150.1145.1147.1125.1126.
ReferenceCeva-Antunes, Bizzo, et al., 2003Pino, Marbot, et al., 2003Demetzos, Angelopoulou, et al., 2002Pino, Marbot, et al., 2002Pino, Marbot, et al., 2002, 2
Comment MSDC-RI MSDC-RI MSDC-RI MSDC-RI MSDC-RI
Column type Capillary
Active phase HP-5
Column length (m) 30.
Carrier gas He
Substrate
Column diameter (mm) 0.25
Phase thickness (μm) 0.25
Tstart (C) 60.
Tend (C) 280.
Heat rate (K/min) 3.
Initial hold (min)
Final hold (min)
I 1132.
ReferencePitarokili, Couladis, et al., 2002
Comment MSDC-RI

References

Ceva-Antunes, Bizzo, et al., 2003
Ceva-Antunes, P.M.N.; Bizzo, H.R.; Alves, S.M.; Antunes, O.A.C., Analysis of volatile compounds of taperebá (Spondias mombin L.) and Cajá (Spondias mombin L.) by simultaneous distillation and extraction (SDE) and solid phase microextraction (SPME), J. Agric. Food Chem., 2003, 51, 5, 1387-1392, https://doi.org/10.1021/jf025873m . [all data]

Pino, Marbot, et al., 2003
Pino, J.; Marbot, R.; Rosado, A.; Vázquez, C., Volatile constituents of fruits of Garcinia dulcis Kurz. from Cuba, Flavour Fragr. J., 2003, 18, 4, 271-274, https://doi.org/10.1002/ffj.1187 . [all data]

Demetzos, Angelopoulou, et al., 2002
Demetzos, C.; Angelopoulou, D.; Perdetzoglou, D., A comparative study of the essential oils of Cistus salviifolius in several populations of Crete (Greece), Biochem. Syst. Ecol., 2002, 30, 7, 651-665, https://doi.org/10.1016/S0305-1978(01)00145-4 . [all data]

Pino, Marbot, et al., 2002
Pino, J.A.; Marbot, R.; Bello, A., Volatile compounds of Psidium salutare (H.B.K.) Berg. fruit, J. Agric. Food Chem., 2002, 50, 18, 5146-5148, https://doi.org/10.1021/jf0116303 . [all data]

Pino, Marbot, et al., 2002, 2
Pino, J.A.; Marbot, R.; Vázquez, C., Characterization of volatile in Cosa Rican Guava [Psidium friedrichsthalianum (Berg) Niedenzu] fruit, J. Agric. Food Chem., 2002, 50, 21, 6023-6026, https://doi.org/10.1021/jf011456i . [all data]

Pitarokili, Couladis, et al., 2002
Pitarokili, D.; Couladis, M.; Petsikos-Panayotarou, N.; Tzakou, O., Composition and antifungal activity on soil-borne pathogens of the essential oil of Salvia sclarea from Greece, J. Agric. Food Chem., 2002, 50, 23, 6688-6691, https://doi.org/10.1021/jf020422n . [all data]