Tricosanal

Normal alkane RI, non-polar column, temperature ramp

Data compiled by: NIST Mass Spectrometry Data Center, William E. Wallace, director

Column type CapillaryCapillary
Active phase Ultra-1SE-54
Column length (m) 25.25.
Carrier gas HeN2
Substrate
Column diameter (mm) 0.320.25
Phase thickness (μm) 0.25
Tstart (C) 80.60.
Tend (C) 260.260.
Heat rate (K/min) 3.6.
Initial hold (min)  2.
Final hold (min)
I 2511.2530.
ReferenceOkumura, 1991Bestmann, Classen, et al., 1988
Comment MSDC-RI MSDC-RI

Van Den Dool and Kratz RI, non-polar column, temperature ramp

Data compiled by: NIST Mass Spectrometry Data Center, William E. Wallace, director

Column type Capillary
Active phase HP-5
Column length (m) 30.
Carrier gas He
Substrate
Column diameter (mm) 0.25
Phase thickness (μm) 0.25
Tstart (C) 50.
Tend (C) 280.
Heat rate (K/min) 4.
Initial hold (min) 5.
Final hold (min)
I 2531.
ReferenceLazari, Skaltsa, et al., 2000
Comment MSDC-RI

References

Okumura, 1991
Okumura, T., retention indices of environmental chemicals on methyl silicone capillary column, Journal of Environmental Chemistry (Japan), 1991, 1, 2, 333-358, https://doi.org/10.5985/jec.1.333 . [all data]

Bestmann, Classen, et al., 1988
Bestmann, H.-J.; Classen, B.; Kobold, U.; Vostrowsky, O.; Klingauf, F.; Stein, U., Steam volatile constituents from leaves of Rhus typhina, Phytochemistry, 1988, 27, 1, 85-90, https://doi.org/10.1016/0031-9422(88)80595-8 . [all data]