Prometryn

Gas phase thermochemistry data

Data compiled by: Hussein Y. Afeefy, Joel F. Liebman, and Stephen E. Stein

Quantity Value Units Method Reference Comment
Δfgas7. ± 11.kJ/molCcbLyubarskii, Gromova, et al., 1985

Condensed phase thermochemistry data

Data compiled by: Hussein Y. Afeefy, Joel F. Liebman, and Stephen E. Stein

Quantity Value Units Method Reference Comment
Δfsolid-102. ± 10.kJ/molCcbLyubarskii, Gromova, et al., 1985
Quantity Value Units Method Reference Comment
Δcsolid-7151.4 ± 9.2kJ/molCcbLyubarskii, Gromova, et al., 1985

Phase change data

Data compiled as indicated in comments:
TRC - Thermodynamics Research Center, NIST Boulder Laboratories, Chris Muzny director
AC - William E. Acree, Jr., James S. Chickos

Quantity Value Units Method Reference Comment
Tfus393.33KN/ADonnelly, Drewes, et al., 1990Uncertainty assigned by TRC = 0.2 K; TRC
Tfus394.4KN/APlato, 1972Uncertainty assigned by TRC = 0.2 K; TRC

Enthalpy of sublimation

ΔsubH (kJ/mol) Temperature (K) Method Reference Comment
100.338.GS-GCStephenson and Malanowski, 1987Based on data from 323. - 393. K. See also Friedrich and Stammbach, 1964.; AC

In addition to the Thermodynamics Research Center (TRC) data available from this site, much more physical and chemical property data is available from the following TRC products:

Normal alkane RI, non-polar column, custom temperature program

Data compiled by: NIST Mass Spectrometry Data Center, William E. Wallace, director

Column type CapillaryCapillaryCapillary
Active phase 5 % Phenyl methyl siloxaneHP-5Ultra-1
Column length (m) 30.30.
Carrier gas Helium
Substrate
Column diameter (mm) 0.250.25
Phase thickness (μm) 0.250.25
Program 50 0C(1 min) 25 0C/min -> 125 0C 10 0C/min -> 300 0C (10 min)50 0C (1 min) 20 0C/min -> 150 0C 10 0C/min -> 280 0Cnot specified
I 1919.1916.1863.
ReferenceDepartment of Food Safety and Welfare, 2006Kawara, Asada, et al., 2005Tameo and Kiyos, 1991
Comment MSDC-RI MSDC-RI MSDC-RI

Kovats' RI, polar column, isothermal

Data compiled by: NIST Mass Spectrometry Data Center, William E. Wallace, director

Column type PackedPackedPacked
Active phase Carbowax 20MCarbowax 20MCarbowax 20M
Column length (m)  1.31.4
Carrier gas N2N2N2
Substrate Chromosorb WChromosorb W AW (80-100 mesh)Chromosorb W
Column diameter (mm)
Phase thickness (μm)
Temperature (C) 215.190.215.
I 2758.2780.2758.
ReferenceLeclercq and Pacáková, 1979Matisová, Krupcík, et al., 1979Pacáková and Nemec, 1978
Comment MSDC-RI MSDC-RI MSDC-RI

Kovats' RI, non-polar column, custom temperature program

Data compiled by: NIST Mass Spectrometry Data Center, William E. Wallace, director

Column type CapillaryCapillary
Active phase HP-5DB-5MS
Column length (m) 30.30.
Carrier gas
Substrate
Column diameter (mm) 0.320.32
Phase thickness (μm) 0.250.25
Program 50C(1min) => 20C/min => 150C => 10C/min => 280C(4min)50 C(1min)->20C/min->200C->10C/min->280C (1.5min)
I 1916.1920.
ReferenceTanabe, Mitobe, et al., 2000Tanabe, Mitobe, et al., 1996
Comment MSDC-RI MSDC-RI

References

Lyubarskii, Gromova, et al., 1985
Lyubarskii, M.V.; Gromova, T.I.; Sukhanova, T.G.; Motorova, T.N., Heats of combustion and of formation of ametrin and prometrin, Russ. J. Phys. Chem. (Engl. Transl.), 1985, 59, 498-500. [all data]

Donnelly, Drewes, et al., 1990
Donnelly, J.R.; Drewes, L.A.; Johnson, R.L.; Munslow, W.D.; Knapp, K.K.; Sovocool, G.W., Purity and heat of fusion data for environmental standards as determined by differential scanning calorimetry, Thermochim. Acta, 1990, 167, 2, 155, https://doi.org/10.1016/0040-6031(90)80476-F . [all data]

Plato, 1972
Plato, C., DSC as a general method for determining purity and heat of fusion of high-purity organic chemicals, Anal. Chem., 1972, 44, 1531. [all data]

Stephenson and Malanowski, 1987
Stephenson, Richard M.; Malanowski, Stanislaw, Handbook of the Thermodynamics of Organic Compounds, 1987, https://doi.org/10.1007/978-94-009-3173-2 . [all data]

Friedrich and Stammbach, 1964
Friedrich, K.; Stammbach, K., Gas chromatographic determination of small vapour pressures determination of the vapour pressures of some triazine herbicides, Journal of Chromatography A, 1964, 16, 22-28, https://doi.org/10.1016/S0021-9673(01)82436-5 . [all data]