C10H13NO2

Reaction thermochemistry data

Data compiled by: John E. Bartmess

Individual Reactions

C10H12NO2- + Hydrogen cation = C10H13NO2

By formula: C10H12NO2- + H+ = C10H13NO2

Quantity Value Units Method Reference Comment
Δr335.9 ± 2.2kcal/molG+TSTaft, 1987gas phase; value altered from reference due to change in acidity scale
Quantity Value Units Method Reference Comment
Δr328.9 ± 2.0kcal/molIMRETaft, 1987gas phase; value altered from reference due to change in acidity scale

Gas phase ion energetics data

Data compiled by: John E. Bartmess

De-protonation reactions

C10H12NO2- + Hydrogen cation = C10H13NO2

By formula: C10H12NO2- + H+ = C10H13NO2

Quantity Value Units Method Reference Comment
Δr335.9 ± 2.2kcal/molG+TSTaft, 1987gas phase; value altered from reference due to change in acidity scale
Quantity Value Units Method Reference Comment
Δr328.9 ± 2.0kcal/molIMRETaft, 1987gas phase; value altered from reference due to change in acidity scale

References

Taft, 1987
Taft, R.W., The Nature and Analysis of Substitutent Electronic Effects, Personal communication. See also Prog. Phys. Org. Chem., 1987, 16, 1. [all data]