pyridin-2-ol

Gas phase thermochemistry data

Data compiled by: Hussein Y. Afeefy, Joel F. Liebman, and Stephen E. Stein

Quantity Value Units Method Reference Comment
Δfgas-79.7 ± 1.5kJ/molCcbSuradi, El Saiad, et al., 1982

Condensed phase thermochemistry data

Data compiled by: Hussein Y. Afeefy, Joel F. Liebman, and Stephen E. Stein

Quantity Value Units Method Reference Comment
Δfsolid-166.3 ± 0.8kJ/molCcbSuradi, El Saiad, et al., 1982
Quantity Value Units Method Reference Comment
Δcsolid-2515.8 ± 0.4kJ/molCcbSuradi, El Saiad, et al., 1982

Phase change data

Data compiled by: Hussein Y. Afeefy, Joel F. Liebman, and Stephen E. Stein

Quantity Value Units Method Reference Comment
Δsub86.6 ± 1.3kJ/molCSuradi, El Saiad, et al., 1982

Reaction thermochemistry data

Data compiled by: Hussein Y. Afeefy, Joel F. Liebman, and Stephen E. Stein

Individual Reactions

2(1H)-Pyridinone = pyridin-2-ol

By formula: C5H5NO = C5H5NO

Quantity Value Units Method Reference Comment
Δr0.88kJ/molEqkCook, Katritzky, et al., 1976liquid phase; solvent: benzene
Δr-4.6kJ/molEqkCook, Katritzky, et al., 1976liquid phase; solvent: Cyclohexane

C5H5NO = pyridin-2-ol

By formula: C5H5NO = C5H5NO

Quantity Value Units Method Reference Comment
Δr1. ± 10.kJ/molKinBeak, Fry, et al., 1976gas phase

Gas phase ion energetics data

Data compiled by: Sharon G. Lias, Rhoda D. Levin, and Sherif A. Kafafi

Ionization energy determinations

IE (eV) Method Reference Comment
8.62PEBursten, Cotton, et al., 1979Vertical value

References

Suradi, El Saiad, et al., 1982
Suradi, S.; El Saiad, N.; Pilcher, G.; Skinner, H.A., Enthalpies of combustion of the three hydroxy-pyridines and the four hydroxy-2-methylpyridines, J. Chem. Thermodyn., 1982, 14, 45-50. [all data]

Cook, Katritzky, et al., 1976
Cook, M.J.; Katritzky, A.R.; Hepler, L.G.; Matsui, T., Heats of solution and tautomeric equilibrium constants. The 2-pyridone: 2-hydroxypyridine equilibrium in non-aqueous media, Tetrahedron Lett., 1976, 2685-2688. [all data]

Beak, Fry, et al., 1976
Beak, P.; Fry, F.S., Jr.; Lee, J.; Steele, F., Equilibration studies. Protomeric equilibria of 2- and 4-Hydroxypyridines, 2- and 4-hydroxypyridines, 2- and 4-mercaptopyridines, and structurally related compounds in the gas phase, J. Am. Chem. Soc., 1976, 98, 171-179. [all data]

Bursten, Cotton, et al., 1979
Bursten, B.E.; Cotton, F.A.; Cowley, A.H.; Hanson, B.E.; Lattman, M.; Stanley, G.S., Strong metal-to-metal quadruple bonds in a series of five isostructural compounds as indicated by photoelectron spectroscopy, J. Am. Chem. Soc., 1979, 101, 6244. [all data]

Bliznyukov and Reznikov, 1955
Bliznyukov, V.I.; Reznikov, V.M., Zhur. Obshchei Khim. (in Rus.), 1955, 25, 1781. [all data]