Senecivernine

Normal alkane RI, non-polar column, temperature ramp

Data compiled by: NIST Mass Spectrometry Data Center, William E. Wallace, director

Column type CapillaryCapillary
Active phase HP-5 MSOV-1
Column length (m) 30.30.
Carrier gas HeliumHe
Substrate
Column diameter (mm) 0.250.32
Phase thickness (μm) 0.250.25
Tstart (C) 100.70.
Tend (C) 280.300.
Heat rate (K/min) 5.6.
Initial hold (min) 2.3.
Final hold (min) 20.
I 2330.2303.
ReferenceChristov and Evstatieva, 2003Woldemichael and Wink, 2002
Comment MSDC-RI MSDC-RI

Kovats' RI, non-polar column, temperature ramp

View large format table.

Column type Active phase I Reference Comment
CapillaryOV-12299.El-Shazly, 200230. m/0.25 mm/0.25 μm, He, 120. C @ 3. min, 6. K/min, 300. C @ 10. min

Van Den Dool and Kratz RI, non-polar column, temperature ramp

View large format table.

Column type Active phase I Reference Comment
CapillaryOV-12285.Witte, Rubiolo, et al., 199225. m/0.25 mm/0.5 μm, H2, 6. K/min; Tstart: 150. C; Tend: 300. C
CapillaryDB-52331.Witte, Rubiolo, et al., 1992He, 6. K/min; Column length: 30. m; Column diameter: 0.32 mm; Tstart: 150. C; Tend: 300. C

Normal alkane RI, non-polar column, custom temperature program

View large format table.

Column type Active phase I Reference Comment
CapillaryDB-5MS2330.Gardner, Thorne, et al., 2006Column length: 30. m; Column diameter: 0.25 mm; Program: 100C(1min) => 20C/min => 200C => 10C/min => 300C

References

Christov and Evstatieva, 2003
Christov, V.; Evstatieva, L., Alkaloid profile of Bulgarian species from genus Senecio L., Z. Naturforsch., 2003, 58c, 300-302. [all data]

Woldemichael and Wink, 2002
Woldemichael, G.M.; Wink, M., Concomitant occurrence of pyrrolizidine and quinolizidine alkaloids in hemiparasite Osyris alba L. (Santalaceae), Biochem. Syst. Ecol., 2002, 30, 2, 139-149, https://doi.org/10.1016/S0305-1978(01)00065-5 . [all data]