Nortriptyline

Van Den Dool and Kratz RI, non-polar column, temperature ramp

Data compiled by: NIST Mass Spectrometry Data Center, William E. Wallace, director

Column type CapillaryCapillaryPackedPackedPacked
Active phase VF-5MSSPB-1Methyl SiliconeMethyl SiliconeMethyl Silicone
Column length (m) 30.30.
Carrier gas HeHe
Substrate
Column diameter (mm) 0.250.75
Phase thickness (μm) 0.251.0
Tstart (C) 60.160.120.120.120.
Tend (C) 270.280.290.290.290.
Heat rate (K/min)  10.7.7.7.
Initial hold (min)   4.4.4.
Final hold (min)  12.10.10.10.
I 2273.82209.2208.2240.2215.
ReferenceTretyakov, 2014Christ, Noomano, et al., 1988Bogusz, Wijsbeek, et al., 1985Bogusz, Wijsbeek, et al., 1985Bogusz, Wijsbeek, et al., 1985
Comment MSDC-RI MSDC-RI MSDC-RI MSDC-RI MSDC-RI
Column type PackedPackedPackedPackedPacked
Active phase Methyl SiliconeMethyl SiliconeMethyl SiliconeMethyl SiliconeMethyl Silicone
Column length (m)
Carrier gas
Substrate
Column diameter (mm)
Phase thickness (μm)
Tstart (C) 120.120.120.120.120.
Tend (C) 290.290.290.290.290.
Heat rate (K/min) 7.7.7.7.7.
Initial hold (min) 4.4.4.4.4.
Final hold (min) 10.10.10.10.10.
I 2217.2220.2220.2212.2215.
ReferenceBogusz, Wijsbeek, et al., 1985Bogusz, Wijsbeek, et al., 1985Bogusz, Wijsbeek, et al., 1985Bogusz, Wijsbeek, et al., 1985Bogusz, Wijsbeek, et al., 1985
Comment MSDC-RI MSDC-RI MSDC-RI MSDC-RI MSDC-RI
Column type PackedPackedPackedPackedPacked
Active phase Methyl SiliconeMethyl SiliconeMethyl SiliconeMethyl SiliconeMethyl Silicone
Column length (m)
Carrier gas
Substrate
Column diameter (mm)
Phase thickness (μm)
Tstart (C) 120.120.120.120.120.
Tend (C) 290.290.290.290.290.
Heat rate (K/min) 7.7.7.7.7.
Initial hold (min) 4.4.4.4.4.
Final hold (min) 10.10.10.10.10.
I 2215.2217.2220.2220.2220.
ReferenceBogusz, Wijsbeek, et al., 1985Bogusz, Wijsbeek, et al., 1985Bogusz, Wijsbeek, et al., 1985Bogusz, Wijsbeek, et al., 1985Bogusz, Wijsbeek, et al., 1985
Comment MSDC-RI MSDC-RI MSDC-RI MSDC-RI MSDC-RI
Column type PackedPackedPackedPackedPacked
Active phase Methyl SiliconeMethyl SiliconeMethyl SiliconeMethyl SiliconeMethyl Silicone
Column length (m)
Carrier gas
Substrate
Column diameter (mm)
Phase thickness (μm)
Tstart (C) 120.120.120.120.120.
Tend (C) 290.290.290.290.290.
Heat rate (K/min) 7.7.7.7.7.
Initial hold (min) 4.4.4.4.4.
Final hold (min) 10.10.10.10.10.
I 2222.2222.2225.2227.2227.
ReferenceBogusz, Wijsbeek, et al., 1985Bogusz, Wijsbeek, et al., 1985Bogusz, Wijsbeek, et al., 1985Bogusz, Wijsbeek, et al., 1985Bogusz, Wijsbeek, et al., 1985
Comment MSDC-RI MSDC-RI MSDC-RI MSDC-RI MSDC-RI
Column type PackedCapillaryCapillaryCapillaryCapillary
Active phase Methyl SiliconeDB-1DB-1DB-1DB-1
Column length (m)  15.15.15.15.
Carrier gas  HeHeHeHe
Substrate
Column diameter (mm)  0.320.250.250.25
Phase thickness (μm)  0.250.250.250.25
Tstart (C) 120.120.120.120.120.
Tend (C) 290.280.280.280.280.
Heat rate (K/min) 7.8.8.12.15.
Initial hold (min) 4.
Final hold (min) 10.5.5.5.5.
I 2227.2191.2191.2202.2200.
ReferenceBogusz, Wijsbeek, et al., 1985Perrigo, Peel, et al., 1985Perrigo, Ballantyne, et al., 1984Perrigo, Ballantyne, et al., 1984Perrigo, Ballantyne, et al., 1984
Comment MSDC-RI MSDC-RI MSDC-RI MSDC-RI MSDC-RI
Column type CapillaryCapillaryPacked
Active phase DB-1SE-30SE-30
Column length (m) 15.15.1.8
Carrier gas HeHeN2
Substrate   Chromosorb W
Column diameter (mm) 0.250.25
Phase thickness (μm) 0.250.25
Tstart (C) 120.100.130.
Tend (C) 280.295.290.
Heat rate (K/min) 5.5.8.
Initial hold (min)   2.
Final hold (min) 5. 8.
I 2180.2174.2215.
ReferencePerrigo, Ballantyne, et al., 1984Anderson and Stafford, 1983Perrigo and Peel, 1981
Comment MSDC-RI MSDC-RI MSDC-RI

Normal alkane RI, non-polar column, custom temperature program

Data compiled by: NIST Mass Spectrometry Data Center, William E. Wallace, director

Column type CapillaryOtherPacked
Active phase OV-1, SE-30, Methyl silicone, SP-2100, OV-101, DB-1, etc.Methyl SiliconeOV-101
Column length (m) 50. 2.
Carrier gas Hydrogen Nitrogen
Substrate   Chromosorb G (100-120 mesh)
Column diameter (mm) 0.32
Phase thickness (μm)
Program not specifiednot specifiednot specified
I 2174.2210.2215.
ReferenceWaggott and Davies, 1984Ardrey and Moffat, 1981Dubsky, Hána, et al., 1978
Comment MSDC-RI MSDC-RI MSDC-RI

Gas phase ion energetics data

Data compiled by: Henry M. Rosenstock, Keith Draxl, Bruce W. Steiner, and John T. Herron

Ionization energy determinations

IE (eV) Method Reference
8.39 ± 0.11CTSFulton and Lyons, 1968

References

Tretyakov, 2014
Tretyakov, K.V., Retention Data. NIST Mass Spectrometry Data Center., NIST Mass Spectrometry Data Center, 2014. [all data]

Christ, Noomano, et al., 1988
Christ, D.W.; Noomano, P.; Rosas, M.; Rhone, D., Retention indices by wide-bore capillary gas chromatography with nitrogen-phosphorus detection, J. Anal. Toxicol., 1988, 12, 2, 84-88, https://doi.org/10.1093/jat/12.2.84 . [all data]

Bogusz, Wijsbeek, et al., 1985
Bogusz, M.; Wijsbeek, J.; Franke, J.P.; de Zeeuw, R.A.; Gierz, J., Impact of biological matrix, drug concentration, and method of isolation on detectability and variability of retention index values in gas chromatography, J. Anal. Toxicol., 1985, 9, 2, 49-54, https://doi.org/10.1093/jat/9.2.49 . [all data]

Perrigo, Peel, et al., 1985
Perrigo, B.J.; Peel, H.W.; Ballantyne, D.J., Use of Dual-Column Fused-Silica Capillary Gas Chromatography in Combination with Detector Response Factors for Analytical Toxicology., J. Chromatogr., 1985, 341, 81-88, https://doi.org/10.1016/S0378-4347(00)84011-6 . [all data]

Perrigo, Ballantyne, et al., 1984
Perrigo, B.J.; Ballantyne, D.J.; Peel, H.W., Condierations in developing a data base for drugs on a DBI capillary column, J. Can. Soc. Forensic Sci., 1984, 17, 2, 41-49, https://doi.org/10.1080/00085030.1984.10757360 . [all data]

Anderson and Stafford, 1983
Anderson, W.H.; Stafford, D.T., Applications of capillary gas chromatography in routine toxicological analyses, J. Hi. Res. Chromatogr. Chromatogr. Comm., 1983, 6, 5, 247-254, https://doi.org/10.1002/jhrc.1240060506 . [all data]

Perrigo and Peel, 1981
Perrigo, B.J.; Peel, H.W., The use of retention indices and temperature-programmed gas chromatography in analytical toxicology, J. Chromatogr. Sci., 1981, 19, 5, 219-226, https://doi.org/10.1093/chromsci/19.5.219 . [all data]