Uranium, tricarbide

Gas phase ion energetics data

Data compiled by: Sharon G. Lias, Rhoda D. Levin, and Sherif A. Kafafi

Ionization energy determinations

IE (eV) Method Reference
8.1 ± 1.0EIGupta and Gingerich, 1979

References

Gupta and Gingerich, 1979
Gupta, S.K.; Gingerich, K.A., Observation and atomization energies of the gaseous uranium carbides, UC, UC2, UC3, UC4, UC5, and UC6 by high temperature mass spectrometry, J. Chem. Phys., 1979, 71, 3072. [all data]