Methoxy-d3 radical

Gas phase ion energetics data

Data compiled by: Sharon G. Lias and Joel F. Liebman

Ionization energy determinations

IE (eV) Method Reference
10.74 ± 0.02PIKuo, Zhang, et al., 1994
10.726 ± 0.008PIRuscic and Berkowitz, 1991

References

Kuo, Zhang, et al., 1994
Kuo, S.-C.; Zhang, Z.; Klemm, R.B.; Liebman, J.F.; Stief, L.J.; Nesbitt, F.L., Photoionization of hydroxymethyl (CD2OH and CD3O) radicals: Photoion efficiency spectra, ionization energies and thermochemistry, J. Phys. Chem., 1994, 98, 4026. [all data]

Ruscic and Berkowitz, 1991
Ruscic, B.; Berkowitz, J., Photoionization mass spectrometric studies of the isomeric transient species CD2OH and CD3O, J. Chem. Phys., 1991, 95, 4033. [all data]