Iron, dicarbonyl(η-2,4-cyclopentadien-1-yl)[η2-pentahydrodiborato(1-)]-

Gas phase ion energetics data

Data compiled by: Sharon G. Lias, John E. Bartmess, Joel F. Liebman, John L. Holmes, Rhoda D. Levin, and W. Gary Mallard

Ionization energy determinations

IE (eV) Method Reference Comment
8.0PEDeKock, Deshmukh, et al., 1983
8.61PEDeKock, Deshmukh, et al., 1983Vertical value

References

DeKock, Deshmukh, et al., 1983
DeKock, R.L.; Deshmukh, P.; Fehlner, T.P.; Housecroft, C.E.; Plotkin, J.S.; Shore, S.G., UV photoelectron spectra and electronic structure of (η5-C5H5)(CO)2FeB2H5. Comparison of the Fe-B bonding with the Fe-C bonding in (CO)4FeC2H4, J. Am. Chem. Soc., 1983, 105, 815. [all data]