Quinoxaline, 2-methyl-

Normal alkane RI, polar column, temperature ramp

Data compiled by: NIST Mass Spectrometry Data Center, William E. Wallace, director

Column type CapillaryCapillary
Active phase HP-InnowaxDB-Wax
Column length (m) 50.30.
Carrier gas HeliumHe
Substrate
Column diameter (mm) 0.200.25
Phase thickness (μm) 0.33
Tstart (C) 50.70.
Tend (C) 250.160.
Heat rate (K/min) 10.2.
Initial hold (min)  8.
Final hold (min) 6.
I 1936.1941.
ReferenceDu, Clery, et al., 2008Wong and Bernhard, 1988
Comment MSDC-RI MSDC-RI

Van Den Dool and Kratz RI, non-polar column, temperature ramp

Data compiled by: NIST Mass Spectrometry Data Center, William E. Wallace, director

Column type Capillary
Active phase DB-1
Column length (m) 60.
Carrier gas
Substrate
Column diameter (mm) 0.25
Phase thickness (μm) 0.25
Tstart (C) 35.
Tend (C) 280.
Heat rate (K/min) 2.
Initial hold (min) 10.
Final hold (min) 10.
I 1272.
ReferenceSpecht and Baltes, 1994
Comment MSDC-RI

References

Du, Clery, et al., 2008
Du, Z.; Clery, R.; Hammond, C.J., Volatile organic nitrogen-containing constituents in ambrette seed Abelmoschus moschatus Medik (Malvaceae), J. Agric. Food Chem., 2008, 56, 16, 7388-7392, https://doi.org/10.1021/jf800958d . [all data]

Wong and Bernhard, 1988
Wong, J.M.; Bernhard, R.A., Effect of nitrogen source on pyrazine formation, J. Agric. Food Chem., 1988, 36, 1, 123-129, https://doi.org/10.1021/jf00079a032 . [all data]