Triphenylene picric acid
- Formula: C24H15N3O7
- Molecular weight: 457.3918
- CAS Registry Number: 72454-49-0

Phase change data

Data compiled as indicated in comments:
TRC - Thermodynamics Research Center, NIST Boulder Laboratories, Chris Muzny director
DH - Eugene S. Domalski and Elizabeth D. Hearing
Quantity | Value | Units | Method | Reference | Comment |
---|---|---|---|---|---|
Tfus | 501.4 | K | N/A | Farrell and Shahidi, 1979 | Uncertainty assigned by TRC = 0.3 K; TRC |
Enthalpy of fusion
ΔfusH (kcal/mol) | Temperature (K) | Reference | Comment |
---|---|---|---|
11.209 | 501.4 | Farrell, Shahidi, et al., 1979 | DH |
Entropy of fusion
ΔfusS (cal/mol*K) | Temperature (K) | Reference | Comment |
---|---|---|---|
22.4 | 501.4 | Farrell, Shahidi, et al., 1979 | DH |

References

Farrell and Shahidi, 1979
Farrell, P.G.; Shahidi, F.,
DSC studies of aromatic hydrocarbon picrates,
Thermochim. Acta, 1979, 33, 275. [all data]
Farrell, Shahidi, et al., 1979
Farrell, P.G.; Shahidi, F.; Casellato, F.; Vecchi, C.; Girelli, A.,
DSC studies of aromatic hydrocarbon picrates,
Thermochim. Acta, 1979, 33, 275-280. [all data]