(6R,7R)-Bisabolone

Normal alkane RI, non-polar column, temperature ramp

Data compiled by: NIST Mass Spectrometry Data Center, William E. Wallace, director

Column type Capillary
Active phase DB-5MS
Column length (m) 30.
Carrier gas He
Substrate
Column diameter (mm) 0.25
Phase thickness (μm) 0.25
Tstart (C) 60.
Tend (C) 240.
Heat rate (K/min) 3.
Initial hold (min)
Final hold (min)
I 1784.
ReferenceCherchi, Deidda, et al., 2001
Comment MSDC-RI

Kovats' RI, non-polar column, temperature ramp

View large format table.

Column type Active phase I Reference Comment
CapillaryDB-51747.Lucero, Fredrickson, et al., 200630. m/0.25 mm/0.25 μm, He, 3. K/min; Tstart: 60. C

Kovats' RI, non-polar column, custom temperature program

View large format table.

Column type Active phase I Reference Comment
CapillaryDB-5MS1755.Tuberoso, Kowalczyk, et al., 200530. m/0.25 mm/0.25 μm, He; Program: 60C(5min) => 2C/min => 140C= 5C/min => 250C(5min)

Van Den Dool and Kratz RI, non-polar column, temperature ramp

View large format table.

Column type Active phase I Reference Comment
CapillaryDB-51742.Isidorov, Zenkevich, et al., 199830. m/0.25 mm/0.25 μm, 3. K/min; Tstart: 50. C; Tend: 250. C

Van Den Dool and Kratz RI, non-polar column, custom temperature program

View large format table.

Column type Active phase I Reference Comment
CapillaryHP-5MS1747.Andriamaharavo, 201430. m/0.25 mm/0.25 μm, He; Program: 60C (1 min) => 5 C/min => 210C => 10 C/min => 280C (15 min)

Normal alkane RI, polar column, temperature ramp

View large format table.

Column type Active phase I Reference Comment
CapillaryDB-Wax2320.van Beek, Kleis, et al., 198960. m/0.25 mm/0.25 μm, H2, 4. K/min, 238. C @ 13. min; Tstart: 50. C

References

Cherchi, Deidda, et al., 2001
Cherchi, G.; Deidda, D.; de Gioannis, B.; Marongiu, B.; Pompei, R.; Porcedda, S., Extraction of Santolina insularis essential oil by supercritical carbon dioxide: influence of some process parameters and biological activity, Flavour Fragr. J., 2001, 16, 1, 35-43, https://doi.org/10.1002/1099-1026(200101/02)16:1<35::AID-FFJ942>3.0.CO;2-Y . [all data]