n-Butyl n-pentyl disulfide

Kovats' RI, non-polar column, isothermal

View large format table.

Column type Active phase Temperature (C) I Reference Comment
PackedApiezon M130.1397.Garbuzov, Misharina, et al., 1985He or N2, Chromosorb W, AW-DMCS; Column length: 2.1 m

Kovats' RI, polar column, isothermal

View large format table.

Column type Active phase Temperature (C) I Reference Comment
PackedCarbowax 20M110.1690.Möckel and Zolg, 1977He, Chromosorb W AW (80-100 mesh); Column length: 6. m

References

Garbuzov, Misharina, et al., 1985
Garbuzov, V.G.; Misharina, T.A.; Aerov, A.F.; Golovnya, R.V., Gas chromatographic retention indices for sulphur(II)-containing organic substances, J. Anal. Chem. USSR (Engl. Transl.), 1985, 40, 4, 576-586. [all data]

Möckel and Zolg, 1977
Möckel, H.J.; Zolg, M., Retentionsindices n-aliphatischer Schwefelverbindungen, Z. Anal. Chem., 1977, 285, 1, 45-46, https://doi.org/10.1007/BF00446017 . [all data]