1,2-dimethyl-3-(1-methylethenyl) cyclopentanol

Normal alkane RI, polar column, custom temperature program

View large format table.

Column type Active phase I Reference Comment
CapillaryCP-Wax 52CB1525.Vernin, 1991Column length: 50. m; Column diameter: 0.32 mm; Program: not specified

References

Vernin, 1991
Vernin, G., Volatile constituents of the essential oil of Santolina chamaecyparissus L., J. Essent. Oil Res., 1991, 3, 1, 49-53, https://doi.org/10.1080/10412905.1991.9697907 . [all data]