2-Butenoic acid, 2-methyl-, 2,3,5,7a-tetrahydro-7-(hydroxymethyl)-1H-pyrrolizin-1-yl ester, [1S-[1α(Z),7aα]]-

Van Den Dool and Kratz RI, non-polar column, temperature ramp

Data compiled by: NIST Mass Spectrometry Data Center, William E. Wallace, director

Column type CapillaryCapillaryCapillary
Active phase DB-1DB-1OV-1
Column length (m) 30.30.25.
Carrier gas HeHeH2
Substrate
Column diameter (mm) 0.320.320.25
Phase thickness (μm)   0.5
Tstart (C) 150.150.150.
Tend (C) 300.300.300.
Heat rate (K/min) 6.6.6.
Initial hold (min)
Final hold (min)
I 1820.1820.1821.
ReferenceWeber, Eisenreich, et al., 1999Witte, Rubiolo, et al., 1992Witte, Rubiolo, et al., 1992
Comment MSDC-RI MSDC-RI MSDC-RI

Normal alkane RI, non-polar column, temperature ramp

Data compiled by: NIST Mass Spectrometry Data Center, William E. Wallace, director

Column type CapillaryCapillary
Active phase HP-5 MSHP-5 MS
Column length (m) 30.30.
Carrier gas HeliumHelium
Substrate
Column diameter (mm) 0.250.25
Phase thickness (μm) 0.250.25
Tstart (C) 100.100.
Tend (C) 280.280.
Heat rate (K/min) 5.5.
Initial hold (min) 2.2.
Final hold (min) 20.20.
I 1818.1820.
ReferenceChristov and Evstatieva, 2003Christov and Evstatieva, 2003
Comment MSDC-RI MSDC-RI

Kovats' RI, non-polar column, temperature ramp

View large format table.

Column type Active phase I Reference Comment
CapillaryOV-11820.El-Shazly, El-Domiaty, et al., 1998He, 6. K/min; Column length: 30. m; Tstart: 150. C; Tend: 300. C
CapillaryDB-11820.El-Shazly, Sarg, et al., 1996He, 170. C @ 5. min, 10. K/min, 300. C @ 15. min; Column length: 30. m; Column diameter: 0.317 mm
CapillaryDB-11820.El-Shazly, Sarg, et al., 1996, 2He, 170. C @ 5. min, 10. K/min, 300. C @ 15. min; Column length: 30. m

References

Weber, Eisenreich, et al., 1999
Weber, S.; Eisenreich, W.; Bacher, A.; Hartmann, T., Pyrrolizidine alkaloids of the lycopsamine type: biosynthesis of thracelanthic acid, Phytochemistry, 1999, 50, 6, 1005-1014, https://doi.org/10.1016/S0031-9422(98)00203-9 . [all data]

Witte, Rubiolo, et al., 1992
Witte, L.; Rubiolo, P.; Bicchi, C.; Hartmann, T., Comparative analysis of pyrrolizidine alkaloids from natural sources by gas chromatography-mass spectrometry, Phytochemistry, 1992, 32, 1, 187-196, https://doi.org/10.1016/0031-9422(92)80130-7 . [all data]