CH4ClP

Reaction thermochemistry data

Data compiled by: John E. Bartmess

Individual Reactions

CH3ClP- + Hydrogen cation = CH4ClP

By formula: CH3ClP- + H+ = CH4ClP

Quantity Value Units Method Reference Comment
Δr326.08kcal/molIMREHurtado, Yanez, et al., 2009gas phase; Anion is dissociative in regard to Cl- loss. G3MP2B3: Cl- loss endo by 8 kcal/mol

References

Hurtado, Yanez, et al., 2009
Hurtado, M.; Yanez, M.; Herrero, R.; Guerrero, A.; Davalos, J.Z.; Abboud, J.L.M.; Khater, B.; Guillemin, J.C., The Ever-Surprising Chemistry of Boron: Enhanced Acidity of Phosphine center dot Boranes, Chem. Eur. J., 2009, 15, 18, 4622-4629, https://doi.org/10.1002/chem.200802307 . [all data]