(3aR,4R,8R,8aS)-3a,4,8a-Trimethyl-7-methylenedecahydro-4,8-methanoazulene-rel-

Van Den Dool and Kratz RI, non-polar column, temperature ramp

Data compiled by: NIST Mass Spectrometry Data Center, William E. Wallace, director

Column type CapillaryCapillaryCapillary
Active phase RTX-1CP Sil 5 CBCP Sil 5 CB
Column length (m) 60.25.25.
Carrier gas HeH2He
Substrate
Column diameter (mm) 0.220.250.25
Phase thickness (μm) 0.25 0.4
Tstart (C) 60.80.80.
Tend (C) 230.270.270.
Heat rate (K/min) 2.10.10.
Initial hold (min)
Final hold (min) 35.
I 1441.1445.1445.
ReferencePaolini J., Costa J., et al., 2007Ziegenbein, Hanssen, et al., 2006Ziegenbein, Hanssen, et al., 2006, 2
Comment MSDC-RI MSDC-RI MSDC-RI

References

Paolini J., Costa J., et al., 2007
Paolini J.; Costa J.; Bernardini A.F., Analysis of the essential oil from the roots of Eupatorium cannabinum subsp corsicum (L.) by GC, GC-MS and C-13-NMR, Phytochem. Anal., 2007, 18, 3, 235-244, https://doi.org/10.1002/pca.977 . [all data]

Ziegenbein, Hanssen, et al., 2006
Ziegenbein, F.C.; Hanssen, H.-P.; König, W.A., Secondary metabolites from Ganoderma lucidum and Spongiporus leucomallellus, Phytochemistry, 2006, 67, 2, 202-211, https://doi.org/10.1016/j.phytochem.2005.10.025 . [all data]

Ziegenbein, Hanssen, et al., 2006, 2
Ziegenbein, F.C.; Hanssen, H.-P.; König, W.A., Chemical constituents of the essential oils of three wood-rotting fungi, Flavour Fragr. J., 2006, 21, 5, 813-816, https://doi.org/10.1002/ffj.1732 . [all data]