Tris(methylammonium)nonachlorodibismuthate

Phase change data

Data compiled by: Eugene S. Domalski and Elizabeth D. Hearing

Temperature of phase transition

Ttrs (K) Initial Phase Final Phase Reference Comment
349.crystaline, IIcrystaline, IBelkyal, Mokhlisse, et al., 1992

Enthalpy of phase transition

ΔHtrs (kcal/mol) Temperature (K) Initial Phase Final Phase Reference Comment
0.204247.crystaline, IIIcrystaline, IIBelkyal, Mokhlisse, et al., 1992

Entropy of phase transition

ΔStrs (cal/mol*K) Temperature (K) Initial Phase Final Phase Reference Comment
0.827247.crystaline, IIIcrystaline, IIBelkyal, Mokhlisse, et al., 1992

References

Belkyal, Mokhlisse, et al., 1992
Belkyal, I.; Mokhlisse, R.; Tanouti, B.; Chanh, N.B.; Couzi, M., Phase transitions in (CH3NH3)3Bi2Cl9 studied by calorimetric, X-ray diffraction and dielectric methods, J. Alloys Compd., 1992, 188, 186-189. [all data]