Cyclopropanecarboxylic acid, 2,3-dimethyl-, methyl ester

Reaction thermochemistry data

Data compiled by: Hussein Y. Afeefy, Joel F. Liebman, and Stephen E. Stein

Individual Reactions

Hydrogen + 1,2-Dimethyl-3-carbomethoxycyclopropene = Cyclopropanecarboxylic acid, 2,3-dimethyl-, methyl ester

By formula: H2 + C7H10O2 = C7H12O2

Quantity Value Units Method Reference Comment
Δr-170.0 ± 1.4kJ/molChydTurner, Goebel, et al., 1968liquid phase; solvent: Acetic acid

References

Turner, Goebel, et al., 1968
Turner, R.B.; Goebel, P.; Mallon, B.J.; Doering, W.E.; Coburn, J.F., Jr.; Pomerantz, M., Heats of hydrogenation. VIII. Compounds with three- and four-membered rings, J. Am. Chem. Soc., 1968, 90, 4315-4322. [all data]