Heptadecane, 9-octyl-

Phase change data

Data compiled as indicated in comments:
TRC - Thermodynamics Research Center, NIST Boulder Laboratories, Chris Muzny director
AC - William E. Acree, Jr., James S. Chickos

Quantity Value Units Method Reference Comment
Tfus259.35KN/AAnonymous, 1968TRC
Tfus259.4KN/AFoehr and Fenske, 1949Uncertainty assigned by TRC = 2. K; TRC
Tfus259.4KN/ASchiessler, 1947Uncertainty assigned by TRC = 1. K; TRC

Enthalpy of vaporization

ΔvapH (kcal/mol) Temperature (K) Method Reference Comment
22.3485.A,MGStephenson and Malanowski, 1987Based on data from 470. - 505. K. See also Schiessler and Whitmore, 1955.; AC

In addition to the Thermodynamics Research Center (TRC) data available from this site, much more physical and chemical property data is available from the following TRC products:

References

Anonymous, 1968
Anonymous, R., Properties of hydrocarbon of high molecular weight, Am. Pet. Inst. Res. Proj. 42, Penn. State Univ., 1968. [all data]

Foehr and Fenske, 1949
Foehr, E.G.; Fenske, M.R., Magneto-optic Rotation of Hydrocarbons, Ind. Eng. Chem., 1949, 41, 1956. [all data]

Schiessler, 1947
Schiessler, R.W., , Am. Pet. Inst. Res. Proj. 42, Twelfth Meeting, 1947. [all data]

Stephenson and Malanowski, 1987
Stephenson, Richard M.; Malanowski, Stanislaw, Handbook of the Thermodynamics of Organic Compounds, 1987, https://doi.org/10.1007/978-94-009-3173-2 . [all data]

Schiessler and Whitmore, 1955
Schiessler, R.W.; Whitmore, F.C., Properties of High Molecular Weight Hydrocarbons, Ind. Eng. Chem., 1955, 47, 8, 1660-1665, https://doi.org/10.1021/ie50548a054 . [all data]