(Z)-6-octadecene

Phase change data

Data compiled by: Thermodynamics Research Center, NIST Boulder Laboratories, Chris Muzny director

Quantity Value Units Method Reference Comment
Tfus254.2KN/AElsner and Paul, 1953Uncertainty assigned by TRC = 2. K

In addition to the Thermodynamics Research Center (TRC) data available from this site, much more physical and chemical property data is available from the following TRC products:

References

Elsner and Paul, 1953
Elsner, B.B.; Paul, P.F.M., J. Chem. Soc., 1953, 1953, 3156. [all data]