5,5-Dimethyl-3-(4-methylphenyl)-cyclohex-2-en-1-one

Gas phase ion energetics data

Data compiled as indicated in comments:
LBLHLM - Sharon G. Lias, John E. Bartmess, Joel F. Liebman, John L. Holmes, Rhoda D. Levin, and W. Gary Mallard

Ionization energy determinations

IE (eV) Method Reference Comment
8.59PEPfister-Guillouzo, Geribaldi, et al., 1982Vertical value; LBLHLM

References

Pfister-Guillouzo, Geribaldi, et al., 1982
Pfister-Guillouzo, G.; Geribaldi, S.; Gal, J.-F., Spectres photoelectroniques de cyclohexene-2-ones-1 diversement substituees en position 3. Correlations avec la reactivite, Can. J. Chem., 1982, 60, 1163. [all data]