hentetracontane

Phase change data

Data compiled as indicated in comments:
TRC - Thermodynamics Research Center, NIST Boulder Laboratories, Chris Muzny director
AC - William E. Acree, Jr., James S. Chickos

Quantity Value Units Method Reference Comment
Tfus332.KN/AHamilton and Kermack, 1952Uncertainty assigned by TRC = 20. K; TRC
Tfus360.3KN/ASeyer, Patterson, et al., 1944Uncertainty assigned by TRC = 2. K; TRC
Tfus353.9KN/ABuchler and Graves, 1927Uncertainty assigned by TRC = 4. K; TRC
Tfus355.7KN/ABuchler and Graves, 1927Uncertainty assigned by TRC = 4. K; TRC

Enthalpy of vaporization

ΔvapH (kJ/mol) Temperature (K) Method Reference Comment
134.1577.A,EStephenson and Malanowski, 1987Based on data from 562. - 804. K. See also Kudchadker and Zwolinski, 1966.; AC

Enthalpy of fusion

ΔfusH (kJ/mol) Temperature (K) Reference Comment
147.2357.5Paunovic and Mehrotra, 2000AC

In addition to the Thermodynamics Research Center (TRC) data available from this site, much more physical and chemical property data is available from the following TRC products:

References

Hamilton and Kermack, 1952
Hamilton; Kermack, J. Chem. Soc., 1952, 1952, 5051. [all data]

Seyer, Patterson, et al., 1944
Seyer, W.F.; Patterson, R.F.; Keays, J.L., The Density and Transition Points of the n-Paraffin Hydrocarbons, J. Am. Chem. Soc., 1944, 66, 179-82. [all data]

Buchler and Graves, 1927
Buchler, C.C.; Graves, G.D., Ind. Eng. Chem., 1927, 19, 718. [all data]

Stephenson and Malanowski, 1987
Stephenson, Richard M.; Malanowski, Stanislaw, Handbook of the Thermodynamics of Organic Compounds, 1987, https://doi.org/10.1007/978-94-009-3173-2 . [all data]

Kudchadker and Zwolinski, 1966
Kudchadker, A.P.; Zwolinski, B.J., Vapor Pressure and Boiling Points of Normal Alkanes, C 21 to C 100 ., J. Chem. Eng. Data, 1966, 11, 2, 253-255, https://doi.org/10.1021/je60029a039 . [all data]

Paunovic and Mehrotra, 2000
Paunovic, Irena; Mehrotra, Anil K., Liquid--solid phase transformation of C16H34, C28H58 and C41H84 and their binary and ternary mixtures, Thermochimica Acta, 2000, 356, 1-2, 27-38, https://doi.org/10.1016/S0040-6031(00)00503-7 . [all data]