nonatriacontane

Phase change data

Data compiled as indicated in comments:
TRC - Thermodynamics Research Center, NIST Boulder Laboratories, Chris Muzny director
AC - William E. Acree, Jr., James S. Chickos

Quantity Value Units Method Reference Comment
Tfus353.4KN/AStenhagen and Tagstrom, 1944Crystal phase 1 phase; Uncertainty assigned by TRC = 0.6 K; TRC
Tfus352.0KN/ABuchler and Graves, 1927Uncertainty assigned by TRC = 4. K; TRC
Tfus352.2KN/ABuchler and Graves, 1927Uncertainty assigned by TRC = 4. K; TRC

Enthalpy of vaporization

ΔvapH (kJ/mol) Temperature (K) Method Reference Comment
130.3567.A,EStephenson and Malanowski, 1987Based on data from 552. - 791. K. See also Kudchadker and Zwolinski, 1966.; AC

In addition to the Thermodynamics Research Center (TRC) data available from this site, much more physical and chemical property data is available from the following TRC products:

References

Stenhagen and Tagstrom, 1944
Stenhagen, E.; Tagstrom, Nonatriacontane, J. Am. Chem. Soc., 1944, 66, 845-6. [all data]

Buchler and Graves, 1927
Buchler, C.C.; Graves, G.D., Ind. Eng. Chem., 1927, 19, 718. [all data]

Stephenson and Malanowski, 1987
Stephenson, Richard M.; Malanowski, Stanislaw, Handbook of the Thermodynamics of Organic Compounds, 1987, https://doi.org/10.1007/978-94-009-3173-2 . [all data]

Kudchadker and Zwolinski, 1966
Kudchadker, A.P.; Zwolinski, B.J., Vapor Pressure and Boiling Points of Normal Alkanes, C 21 to C 100 ., J. Chem. Eng. Data, 1966, 11, 2, 253-255, https://doi.org/10.1021/je60029a039 . [all data]