1,4-Dihydro-1,4-methanonaphthalene-2-carbonitrile

Gas phase ion energetics data

Data compiled as indicated in comments:
LLK - Sharon G. Lias, Rhoda D. Levin, and Sherif A. Kafafi

Ionization energy determinations

IE (eV) Method Reference Comment
8.77 ± 0.05PEPaguette, Ku, et al., 1979Vertical value; LLK
8.77PEKu, Paquette, et al., 1979Vertical value; LLK

References

Paguette, Ku, et al., 1979
Paguette, L.A.; Ku, A.Y.; Santiago, C.; Rozenboom, M.D.; Houk, K.N., Control of regioselectivity in the di-π-methane rearrangement. Triplet-sensitized photoisomerization of benzonorbornadienes carrying cyano substituents in the aryl and vinyl segments, J. Am. Chem. Soc., 1979, 101, 5972. [all data]

Ku, Paquette, et al., 1979
Ku, A.Y.; Paquette, L.A.; Rozeboom, M.D.; Houk, K.N., Polar effects on di-π-methane rearrangements. Regiospecificity in the triplet- sensitized photoisomerizations of 2-cyanobenzonorbornadienes carrying methoxy aryl substituents, J. Am. Chem. Soc., 1979, 101, 5981. [all data]