Fluorodinitromethane

Phase change data

Data compiled as indicated in comments:
ALS - Hussein Y. Afeefy, Joel F. Liebman, and Stephen E. Stein
AC - William E. Acree, Jr., James S. Chickos

Quantity Value Units Method Reference Comment
Δvap10.4 ± 0.2kcal/molVPepekin, Natsibullin, et al., 1974ALS

Enthalpy of vaporization

ΔvapH (kcal/mol) Temperature (K) Method Reference Comment
10.4313.AStephenson and Malanowski, 1987Based on data from 298. - 338. K.; AC

References

Pepekin, Natsibullin, et al., 1974
Pepekin, V.I.; Natsibullin, F.Ya.; Eremenko, L.T.; Lebedev, Yu.A., Enthalpy of formation of fluoronitromethyl radical and dissociation energy of C - H and C - F bonds in fluorodinitromethane, Bull. Acad. Sci. USSR, Div. Chem. Sci., 1974, 23, 892-893. [all data]

Stephenson and Malanowski, 1987
Stephenson, Richard M.; Malanowski, Stanislaw, Handbook of the Thermodynamics of Organic Compounds, 1987, https://doi.org/10.1007/978-94-009-3173-2 . [all data]