1,1,2,2-tetracyclohexylethane

Phase change data

Data compiled by: Thermodynamics Research Center, NIST Boulder Laboratories, Chris Muzny director

Quantity Value Units Method Reference Comment
Tfus432.KN/AZartman and Adkins, 1932Uncertainty assigned by TRC = 3. K

In addition to the Thermodynamics Research Center (TRC) data available from this site, much more physical and chemical property data is available from the following TRC products:

References

Zartman and Adkins, 1932
Zartman, W.H.; Adkins, H., J. Am. Chem. Soc., 1932, 54, 1668. [all data]