Methanethiol, c-d3

Gas phase ion energetics data

Data compiled by: Henry M. Rosenstock, Keith Draxl, Bruce W. Steiner, and John T. Herron

Ionization energy determinations

IE (eV) Method Reference
9.5 ± 0.1EIKeyes and Harrson, 1968

Appearance energy determinations

Ion AE (eV) Other Products MethodReferenceComment
CD3S+11.8 ± 0.1HEIKeyes and Harrson, 1968
CHD2S+12.0 ± 0.1DEIKeyes and Harrson, 1968

References

Keyes and Harrson, 1968
Keyes, B.G.; Harrson, A.G., The fragmentation of aliphatic sulfur compounds by electron impact, J. Am. Chem. Soc., 1968, 90, 5671. [all data]