3-Aza-1,1,1,3,6,6,6-heptanitroheptane

Condensed phase thermochemistry data

Data compiled by: Hussein Y. Afeefy, Joel F. Liebman, and Stephen E. Stein

Quantity Value Units Method Reference Comment
Δfsolid-21.2 ± 0.60kcal/molCcbKustova, Kirpichev, et al., 1981
Quantity Value Units Method Reference Comment
Δcsolid-653.90 ± 0.50kcal/molCcbKustova, Kirpichev, et al., 1981

References

Kustova, Kirpichev, et al., 1981
Kustova, L.V.; Kirpichev, E.P.; Rubtsov, Yu.I.; Avdonin, V.V.; Korepin, A.G.; Eremenko, L.T., Standard enthalpies of formation of certain nitro compounds, Bull. Acad. Sci. USSR, Div. Chem. Sci., 1981, 1830-1836. [all data]