CAS Reg. No. 71736-54-4

Reaction thermochemistry data

Data compiled by: John E. Bartmess

Individual Reactions

(CAS Reg. No. 71736-54-4 • 4294967295nickel) + nickel = CAS Reg. No. 71736-54-4

By formula: (CAS Reg. No. 71736-54-4 • 4294967295Ni) + Ni = CAS Reg. No. 71736-54-4

Quantity Value Units Method Reference Comment
Δr210. ± 21.kJ/molN/AHo, Polak, et al., 1993gas phase

References

Ho, Polak, et al., 1993
Ho, J.; Polak, M.L.; Ervin, K.M.; Lineberger, W.C., Photoelectron Spectroscopy of Nickel Group Dimers - Ni2(-), Pd2(-), and Pt2(-), J. Chem. Phys., 1993, 99, 11, 8542, https://doi.org/10.1063/1.465577 . [all data]