1,3,5-Trimethyl-4-nitrosopyrazole

Phase change data

Data compiled by: William E. Acree, Jr., James S. Chickos

Quantity Value Units Method Reference Comment
Δsub21.0 ± 0.48kcal/molCRibeiro da Silva, Ferreira, et al., 2001

References

Ribeiro da Silva, Ferreira, et al., 2001
Ribeiro da Silva, Maria D.M.C.; Ferreira, Susana C.C.; Rodrigues, Ivone A.P.; da Silva, Luís C.M.; Acree Jr, William E.; Pandey, Siddharth; Roy, Lindsay E., Experimental standard molar enthalpies of formation of crystalline 3,5-dimethylpyrazole, 3,5-dimethyl-4-nitrosopyrazole, 1,3,5-trimethyl-4-nitrosopyrazole, and 3,5-dimethyl-1-phenyl-4-nitrosopyrazole, The Journal of Chemical Thermodynamics, 2001, 33, 10, 1227-1235, https://doi.org/10.1006/jcht.2000.0768 . [all data]