1H-Benzimidazole, 2-phenyl-

Phase change data

Data compiled by: William E. Acree, Jr., James S. Chickos

Quantity Value Units Method Reference Comment
Δsub123.0 ± 1.7kJ/molCRibeiro da Silva, Ribeiro da Silva, et al., 2005

Enthalpy of fusion

ΔfusH (kJ/mol) Temperature (K) Reference
22.18572.2Kambe, Mita, et al., 1971

References

Ribeiro da Silva, Ribeiro da Silva, et al., 2005
Ribeiro da Silva, Manuel A.V.; Ribeiro da Silva, Maria das Dores M.C.; Amaral, Luísa M.P.F.; Elguero, José; Jiménez, Pilar; Roux, Maria Victoria; Dávalos, Juan Z.; Temprado, Manuel; Cabildo, Pilar; Claramunt, Rosa M.; Mó, Otília; Yáñez, Manuel, Thermochemical properties of two benzimidazole derivatives: 2-Phenyl- and 2-benzylbenzimidazole, The Journal of Chemical Thermodynamics, 2005, 37, 11, 1168-1176, https://doi.org/10.1016/j.jct.2005.02.008 . [all data]

Kambe, Mita, et al., 1971
Kambe, H.; Mita, I.; Yokata, R., , Proceedings of the Third ICTAC, Davos Swizz, 1971, 387. [all data]