SSBr2

Vibrational and/or electronic energy levels

Data compiled by: Marilyn E. Jacox

State:   X

Vib.
sym.
 No.   Approximate
 type of mode
 cm-1   Med.   Method   References

a' SS stretch 693 Ar IR Feuerhahn and Vahl, 1979
SBr2 stretch 317 Ar IR Feuerhahn and Vahl, 1979
a SBr2 stretch 311 Ar IR Feuerhahn and Vahl, 1979

Additional references: Jacox, 1994, page 226

References

Feuerhahn and Vahl, 1979
Feuerhahn, M.; Vahl, G., Infrared spectroscopic evidence for thiothionyl chloride and bromide in argon matrices at 9 K, Chem. Phys. Lett., 1979, 65, 2, 322, https://doi.org/10.1016/0009-2614(79)87073-6 . [all data]

Jacox, 1994
Jacox, M.E., Vibrational and electronic energy levels of polyatomic transient molecules, American Chemical Society, Washington, DC, 1994, 464. [all data]