1,3-Propanedione,1-(4-methoxyphenyl)-2,2-dimethyl-3-phenyl-

Gas phase ion energetics data

Data compiled by: Sharon G. Lias, Rhoda D. Levin, and Sherif A. Kafafi

Ionization energy determinations

IE (eV) Method Reference Comment
8.6 ± 0.05PEMcAlduff and Bunbury, 1979Vertical value

References

McAlduff and Bunbury, 1979
McAlduff, E.J.; Bunbury, D.L., Photoelectron spectra of some aromatic mono-and di-ketones, J. Electron Spectrosc. Relat. Phenom., 1979, 17, 81. [all data]