Medroxyprogesterone acetate

Van Den Dool and Kratz RI, non-polar column, temperature ramp

Data compiled by: NIST Mass Spectrometry Data Center, William E. Wallace, director

Column type Capillary
Active phase Ultra-2
Column length (m) 25.
Carrier gas He
Substrate
Column diameter (mm) 0.2
Phase thickness (μm) 0.33
Tstart (C) 200.
Tend (C) 280.
Heat rate (K/min) 5.
Initial hold (min)
Final hold (min) 10.
I 2947.
ReferenceDaeseleire, de Guesquiere, et al., 1991
Comment MSDC-RI

References

Daeseleire, de Guesquiere, et al., 1991
Daeseleire, E.; de Guesquiere, A.; van Peteghem, C., Derivatization and gas chromatographic-mass spectrometric detection of anabolic steroid residues isolated from edible muscle tissue, J. Chromatogr., 1991, 562, 1-2, 673-679, https://doi.org/10.1016/0378-4347(91)80617-L . [all data]