Benzoyl chloride, p,p'-oxybis-

Condensed phase thermochemistry data

Data compiled by: Hussein Y. Afeefy, Joel F. Liebman, and Stephen E. Stein

Quantity Value Units Method Reference Comment
Δfsolid-432.2kJ/molCcbKaryakin, Mochalov, et al., 1975
Δfsolid-432.2kJ/molCcbSapozhnikov, Mochalov, et al., 1973
Quantity Value Units Method Reference Comment
Δcsolid-6266.8kJ/molCcbKaryakin, Mochalov, et al., 1975
Δcsolid-6266.8 ± 6.3kJ/molCcbSapozhnikov, Mochalov, et al., 1973

References

Karyakin, Mochalov, et al., 1975
Karyakin, N.V.; Mochalov, A.N.; Rabinovich, I.B.; Kamelova, G.P.; Berestneva, G.L.; Astaf'ev, S.A.; Korshak, V.V., Thermodynamics of synthesis of poly-(p,p'-diphenyl-enexido) -1,3,4-oxadiazole by intramolecular cyclodehydration of poly-(p,p'-diphenyleneoxido)-hydrazide, Polym. Sci. USSR, 1975, 17, 2174-2181. [all data]

Sapozhnikov, Mochalov, et al., 1973
Sapozhnikov, V.N.; Mochalov, A.N.; Karyakin, N.V.; Kunyavskaya, S.G.; Chernova, V.I.; Rabinovich, I.B., Low-temperature heat capacity and thermodynamic properties of some acid dichlorides, Tr. Khim. Khim. Tekhnol., 1973, 55-57. [all data]